Target
Cyclin-C
Ligand
BDBM50169074
Substrate
Meas. Tech.
ChEMBL_1577630 (CHEMBL3807238)
IC50
32±n/a nM
Citation
 Koehler, MFBergeron, PBlackwood, EMBowman, KClark, KRFirestein, RKiefer, JRMaskos, KMcCleland, MLOrren, LSalphati, LSchmidt, SSchneider, EVWu, JBeresini, MH Development of a Potent, Specific CDK8 Kinase Inhibitor Which Phenocopies CDK8/19 Knockout Cells. ACS Med Chem Lett 7:223-8 (2016)  
Target
Name:
Cyclin-C
Synonyms:
CCNC Cyclin C hSRB11
Type:
PROTEIN
Mol. Mass.:
33244.88
Organism:
Homo sapiens (Human)
Description:
ChEMBL_107900
Residue:
283
  
Inhibitor
Name:
BDBM50169074
Synonyms:
CHEMBL3806037
Type:
Small organic molecule
Emp. Form.:
C15H10ClNO2S
Mol. Mass.:
303.763
SMILES:
CC(=O)c1cc2c(Oc3ccc(Cl)cc3)cncc2s1
: