Target
Ectonucleotide pyrophosphatase/phosphodiesterase family member 2
Ligand
BDBM50200666
Substrate
Meas. Tech.
ChEMBL_1622711 (CHEMBL3865063)
IC50
444±n/a nM
Citation
 Shah, PCheasty, AFoxton, CRaynham, TFarooq, MGutierrez, IFLejeune, APritchard, MTurnbull, APang, LOwen, PBoyd, SStowell, AJordan, AHamilton, NMHitchin, JRStockley, MMacDonald, EQuesada, MJTrivier, ESkeete, JOvaa, HMoolenaar, WHRyder, H Discovery of potent inhibitors of the lysophospholipase autotaxin. Bioorg Med Chem Lett 26:5403-5410 (2016)  
Target
Name:
Ectonucleotide pyrophosphatase/phosphodiesterase family member 2
Synonyms:
ATX Autotaxin (ATX) ENPP2 Ectonucleotide Pyrophosphatase/Phosphodiesterase 2 (ENPP2) Extracellular lysophospholipase D PDNP2
Type:
Enzyme
Mol. Mass.:
99007.13
Organism:
Homo sapiens (Human)
Description:
Q13822
Residue:
863
  
Inhibitor
Name:
BDBM50200666
Synonyms:
CHEMBL3916898
Type:
Small organic molecule
Emp. Form.:
C24H22F2N4O
Mol. Mass.:
420.4545
SMILES:
C[C@H](NC(=O)CCc1nc2cccnc2n1Cc1ccc(F)cc1)c1ccc(F)cc1
: