Target
Tyrosine-protein kinase BTK
Ligand
BDBM50201722
Substrate
Meas. Tech.
ChEMBL_1623333 (CHEMBL3865685)
IC50
1970±n/a nM
Citation
 Pujala, BAgarwal, AKMiddya, SBanerjee, MSurya, ANayak, AKGupta, AKhare, SGuguloth, RRandive, NAShinde, BUThakur, APatel, DIRaja, MGreen, MJAlfaro, JAvila, PPérez de Arce, FAlmirez, RGKanno, SBernales, SHung, DTChakravarty, SMcCullagh, EQuinn, KPRai, RPham, SM Discovery of Pyrazolopyrimidine Derivatives as Novel Dual Inhibitors of BTK and PI3Kd. ACS Med Chem Lett 7:1161-1166 (2016)  
Target
Name:
Tyrosine-protein kinase BTK
Synonyms:
AGMX1 Agammaglobulinaemia tyrosine kinase B cell progenitor kinase BPK BTK_HUMAN Tyrosine Kinase BTK Tyrosine-protein kinase BTK (BTK)
Type:
Enzyme
Mol. Mass.:
76289.95
Organism:
Homo sapiens (Human)
Description:
Q06187
Residue:
659
  
Inhibitor
Name:
BDBM50201722
Synonyms:
CHEMBL3977335
Type:
Small organic molecule
Emp. Form.:
C21H18FN5O
Mol. Mass.:
375.3989
SMILES:
COc1cc(F)cc(c1)-c1nn(C2Cc3ccccc3C2)c2ncnc(N)c12
: