Target
Tyrosine-protein kinase BTK
Ligand
BDBM50201721
Substrate
Meas. Tech.
ChEMBL_1623333 (CHEMBL3865685)
IC50
12±n/a nM
Citation
 Pujala, BAgarwal, AKMiddya, SBanerjee, MSurya, ANayak, AKGupta, AKhare, SGuguloth, RRandive, NAShinde, BUThakur, APatel, DIRaja, MGreen, MJAlfaro, JAvila, PPérez de Arce, FAlmirez, RGKanno, SBernales, SHung, DTChakravarty, SMcCullagh, EQuinn, KPRai, RPham, SM Discovery of Pyrazolopyrimidine Derivatives as Novel Dual Inhibitors of BTK and PI3Kd. ACS Med Chem Lett 7:1161-1166 (2016)  
Target
Name:
Tyrosine-protein kinase BTK
Synonyms:
AGMX1 Agammaglobulinaemia tyrosine kinase B cell progenitor kinase BPK BTK_HUMAN Tyrosine Kinase BTK Tyrosine-protein kinase BTK (BTK)
Type:
Enzyme
Mol. Mass.:
76289.95
Organism:
Homo sapiens (Human)
Description:
Q06187
Residue:
659
  
Inhibitor
Name:
BDBM50201721
Synonyms:
CHEMBL3964073
Type:
Small organic molecule
Emp. Form.:
C20H16BrN5O
Mol. Mass.:
422.278
SMILES:
Nc1ncnc2n(nc(-c3ccc(Br)c(O)c3)c12)C1Cc2ccccc2C1
: