Target
Phosphatidylinositol 4,5-bisphosphate 3-kinase catalytic subunit delta isoform
Ligand
BDBM50323728
Substrate
Meas. Tech.
ChEMBL_1623366 (CHEMBL3865718)
IC50
0.700000±n/a nM
Citation
 Pujala, BAgarwal, AKMiddya, SBanerjee, MSurya, ANayak, AKGupta, AKhare, SGuguloth, RRandive, NAShinde, BUThakur, APatel, DIRaja, MGreen, MJAlfaro, JAvila, PPérez de Arce, FAlmirez, RGKanno, SBernales, SHung, DTChakravarty, SMcCullagh, EQuinn, KPRai, RPham, SM Discovery of Pyrazolopyrimidine Derivatives as Novel Dual Inhibitors of BTK and PI3Kd. ACS Med Chem Lett 7:1161-1166 (2016)  
Target
Name:
Phosphatidylinositol 4,5-bisphosphate 3-kinase catalytic subunit delta isoform
Synonyms:
PI3-kinase p110 subunit delta PI3-kinase subunit p110-delta PIK3CD Phosphatidylinositol 4,5-biphosphate 3-kinase catalytic subunit delta (PIK3CD) Phosphatidylinositol 4,5-bisphosphate 3-kinase 110 kDa catalytic subunit delta (PI3K delta) Phosphatidylinositol 4,5-bisphosphate 3-kinase catalytic subunit delta (PI3Kdelta) Phosphatidylinositol 4,5-bisphosphate 3-kinase catalytic subunit delta isoform (PI3K delta) Phosphatidylinositol 4,5-bisphosphate 3-kinase catalytic subunit delta isoform (PI3K-delta) Phosphatidylinositol 4,5-bisphosphate 3-kinase catalytic subunit delta isoform (PI3Kdelta)
Type:
Enzyme Subunit
Mol. Mass.:
119489.41
Organism:
Homo sapiens (Human)
Description:
O00329
Residue:
1044
  
Inhibitor
Name:
BDBM50323728
Synonyms:
2-((4-amino-3-(3-fluoro-5-hydroxyphenyl)-1H-pyrazolo[3,4-d]pyrimidin-1-yl)methyl)-5-methyl-3-o-tolylquinazolin-4(3H)-one CHEMBL1213084
Type:
Small organic molecule
Emp. Form.:
C28H22FN7O2
Mol. Mass.:
507.5184
SMILES:
Cc1ccccc1-n1c(Cn2nc(-c3cc(O)cc(F)c3)c3c(N)ncnc23)nc2cccc(C)c2c1=O
: