Target
Free fatty acid receptor 4
Ligand
BDBM50207056
Substrate
Meas. Tech.
ChEMBL_1629516 (CHEMBL3872142)
EC50
10.0±n/a nM
Citation
 Adams, GLVelazquez, FJayne, CShah, UMiao, SAshley, ERMadeira, MAkiyama, TEDi Salvo, JSuzuki, TWang, NTruong, QGilbert, EZhou, DVerras, AKirkland, MPachanski, MPowles, MYin, WUjjainwalla, FVenkatraman, SEdmondson, SD Discovery of Chromane Propionic Acid Analogues as Selective Agonists of GPR120 with ACS Med Chem Lett 8:96-101 (2017)  
Target
Name:
Free fatty acid receptor 4
Synonyms:
FFAR4 G-protein coupled receptor 120 G-protein coupled receptor GT01 GPR120 O3FAR1 PGR4
Type:
PROTEIN
Mol. Mass.:
42256.91
Organism:
Homo sapiens (Human)
Description:
ChEMBL_1508994
Residue:
377
  
Inhibitor
Name:
BDBM50207056
Synonyms:
CHEMBL3970238
Type:
Small organic molecule
Emp. Form.:
C22H23FO4
Mol. Mass.:
370.414
SMILES:
OC(=O)CC[C@H]1CCc2cc(ccc2O1)-c1cc(OC2CCC2)ccc1F
: