Target
Free fatty acid receptor 1
Ligand
BDBM50208084
Substrate
Meas. Tech.
ChEMBL_1632279 (CHEMBL3874985)
EC50
>10000±n/a nM
Citation
 Cox, JMChu, HDChelliah, MVDebenham, JSEagen, KLan, PLombardo, MLondon, CPlotkin, MAShah, USun, ZVaccaro, HMVenkatraman, SSuzuki, TWang, NAshley, ERCrespo, AMadeira, MLeung, DHAlleyne, COgawa, AMSouza, SThomas-Fowlkes, BDi Salvo, JWeinglass, AKirkland, MPachanski, MPowles, MATozzo, EAkiyama, TEUjjainwalla, FTata, JRSinz, CJ Design, Synthesis, and Evaluation of Novel and Selective G-protein Coupled Receptor 120 (GPR120) Spirocyclic Agonists. ACS Med Chem Lett 8:49-54 (2017)  
Target
Name:
Free fatty acid receptor 1
Synonyms:
FFAR1 G-protein Coupled Receptor 40 | GPR40
Type:
G Protein-Coupled Receptor (GPCR)
Mol. Mass.:
31473.32
Organism:
Homo sapiens (Human)
Description:
O14842
Residue:
300
  
Inhibitor
Name:
BDBM50208084
Synonyms:
CHEMBL3977361 | US9708270, 8
Type:
Small organic molecule
Emp. Form.:
C19H26ClNO3
Mol. Mass.:
351.868
SMILES:
COc1ccc(Cl)c(c1)N1CCC2(CCC(CC(O)=O)CC2)CC1
: