Target
Neuronal acetylcholine receptor subunit alpha-7
Ligand
BDBM50211195
Substrate
Meas. Tech.
ChEMBL_1636027 (CHEMBL3878925)
EC50
140±n/a nM
Citation
 Cook, JZusi, FCMcDonald, IMKing, DHill, MDIwuagwu, CMate, RAFang, HZhao, RWang, BCutrone, JMa, BGao, QKnox, RJMatchett, MGallagher, LFerrante, MPost-Munson, DMolski, TEaston, AMiller, RJones, KDigavalli, SHealy, FLentz, KBenitex, YClarke, WNatale, JSiuciak, JALodge, NZaczek, RDenton, RMorgan, DBristow, LJMacor, JEOlson, RE Design and Synthesis of a New Series of 4-Heteroarylamino-1'-azaspiro[oxazole-5,3'-bicyclo[2.2.2]octanes asa7 Nicotinic Receptor Agonists. 1. Development of Pharmacophore and Early Structure-Activity Relationship. J Med Chem 59:11171-11181 (2016)  
Target
Name:
Neuronal acetylcholine receptor subunit alpha-7
Synonyms:
ACHA7_RAT Cholinergic, Nicotinic Alpha7 Chrna7 Neuronal acetylcholine receptor (alpha7 nAChR) Neuronal acetylcholine receptor subunit alpha-7 Neuronal acetylcholine receptor subunit alpha-7 (nAChR)
Type:
Enzyme
Mol. Mass.:
56502.44
Organism:
Rattus norvegicus (Rat)
Description:
Q05941
Residue:
502
  
Inhibitor
Name:
BDBM50211195
Synonyms:
CHEMBL3944506
Type:
Small organic molecule
Emp. Form.:
C17H20N4O2S
Mol. Mass.:
344.431
SMILES:
COc1ccc2nc(NC3=NC[C@@]4(CN5CCC4CC5)O3)sc2c1
: