Target
Glucose-dependent insulinotropic receptor
Ligand
BDBM50232624
Substrate
Meas. Tech.
ChEMBL_1648274 (CHEMBL3997330)
EC50
1.6±n/a nM
Citation
 Zhu, CWang, LZhu, YGuo, ZZLiu, PHu, ZSzewczyk, JWKang, LChicchi, GEhrhardt, AWoods, ASeo, TWoods, Mvan Heek, MDingley, KHPang, JSalituro, GMPowell, JTerebetski, JLHornak, VCampeau, LCOrr, RKUjjainwalla, FMiller, MStamford, AWood, HBKowalski, TNargund, RPEdmondson, SD Discovery of phenyl acetamides as potent and selective GPR119 agonists. Bioorg Med Chem Lett 27:1124-1128 (2017)  
Target
Name:
Glucose-dependent insulinotropic receptor
Synonyms:
GP119_MOUSE | Gpr119
Type:
PROTEIN
Mol. Mass.:
37009.07
Organism:
Mus musculus
Description:
ChEMBL_1506420
Residue:
335
  
Inhibitor
Name:
BDBM50232624
Synonyms:
CHEMBL4099186
Type:
Small organic molecule
Emp. Form.:
C25H30ClFN4O2
Mol. Mass.:
472.983
SMILES:
Fc1cc(CC(=O)N2CCC2)ccc1OCC[C@@H]1C[C@@H]1C1CCN(CC1)c1ncc(Cl)cn1
: