Target
Sodium-dependent serotonin transporter
Ligand
BDBM50235075
Substrate
Meas. Tech.
ChEMBL_1654662 (CHEMBL4004028)
IC50
>10000±n/a nM
Citation
 Harper, BHWang, LZhu, CKar, NFLi, BMoyes, CRGoble, SDCosta, MDingley, KDi Salvo, JHa, SNHurley, ALi, XMiller, RRNagabukuro, HSalituro, GMSmith, SStruthers, MHale, JJEdmondson, SDBerger, R Investigation of piperazine benzamides as humanß Bioorg Med Chem Lett 27:1094-1098 (2017)  
Target
Name:
Sodium-dependent serotonin transporter
Synonyms:
5-HT Transporter 5HTT SC6A4_HUMAN SLC6A4 Serotonin transporter (5HTT) Sodium-dependent serotonin transporter (SERT) | Solute carrier family 6 member 4
Type:
Multi-pass membrane protein
Mol. Mass.:
70322.51
Organism:
Homo sapiens (Human)
Description:
P31645
Residue:
630
  
Inhibitor
Name:
BDBM50235075
Synonyms:
CHEMBL4095361
Type:
Small organic molecule
Emp. Form.:
C32H36N6O3
Mol. Mass.:
552.6666
SMILES:
[H][C@@]1(CC[C@@H](Cc2ccc(cc2)C(=O)N2CCN(Cc3cccc(n3)-c3nnc(C)o3)CC2)N1)[C@H](O)c1ccccc1
: