Target
Beta-1 adrenergic receptor
Ligand
BDBM50235077
Substrate
Meas. Tech.
ChEMBL_1654658 (CHEMBL4004024)
IC50
>20000±n/a nM
Citation
 Harper, BHWang, LZhu, CKar, NFLi, BMoyes, CRGoble, SDCosta, MDingley, KDi Salvo, JHa, SNHurley, ALi, XMiller, RRNagabukuro, HSalituro, GMSmith, SStruthers, MHale, JJEdmondson, SDBerger, R Investigation of piperazine benzamides as humanß Bioorg Med Chem Lett 27:1094-1098 (2017)  
Target
Name:
Beta-1 adrenergic receptor
Synonyms:
ADRB1 ADRB1_HUMAN Beta-1 adrenoceptor adrenergic Beta1
Type:
G Protein-Coupled Receptor (GPCR)
Mol. Mass.:
51338.40
Organism:
Homo sapiens (Human)
Description:
P08588
Residue:
477
  
Inhibitor
Name:
BDBM50235077
Synonyms:
CHEMBL4074920
Type:
Small organic molecule
Emp. Form.:
C32H36N6O3
Mol. Mass.:
552.6666
SMILES:
[H][C@@]1(CC[C@@H](Cc2ccc(cc2)C(=O)N2CCN(Cc3cccc(n3)-c3nc(C)no3)CC2)N1)[C@H](O)c1ccccc1
: