Target
Potassium voltage-gated channel subfamily H member 2
Ligand
BDBM50235079
Substrate
Meas. Tech.
ChEMBL_1654660 (CHEMBL4004026)
IC50
>60000±n/a nM
Citation
 Harper, BHWang, LZhu, CKar, NFLi, BMoyes, CRGoble, SDCosta, MDingley, KDi Salvo, JHa, SNHurley, ALi, XMiller, RRNagabukuro, HSalituro, GMSmith, SStruthers, MHale, JJEdmondson, SDBerger, R Investigation of piperazine benzamides as humanß Bioorg Med Chem Lett 27:1094-1098 (2017)  
Target
Name:
Potassium voltage-gated channel subfamily H member 2
Synonyms:
1,3-beta-glucan synthase component GLS2 ERG Eag-related protein 1 Ether-a-go-go-related gene (HERG) Ether-a-go-go-related gene potassium channel 1 Ether-a-go-go-related gene potassium channel 1 (hERG1) Ether-a-go-go-related protein 1 H-ERG KCNH2 Potassium voltage-gated channel subfamily H member 2 (hERG) Voltage-gated potassium channel subunit Kv11.1 hERG Potassium Channel 1 | putative potassium channel subunit
Type:
Multi-pass membrane protein
Mol. Mass.:
126672.65
Organism:
Homo sapiens (Human)
Description:
Q12809
Residue:
1159
  
Inhibitor
Name:
BDBM50235079
Synonyms:
CHEMBL4103112
Type:
Small organic molecule
Emp. Form.:
C27H33F2N7O2
Mol. Mass.:
525.5934
SMILES:
[H][C@@]1(CC[C@@H](Cc2ccc(cc2)C(=O)N2CCN(Cc3nnn(CC(F)F)n3)CC2)N1)[C@H](O)c1ccccc1
: