Target
Beta-3 adrenergic receptor
Ligand
BDBM50235121
Substrate
Meas. Tech.
ChEMBL_1654656 (CHEMBL4004022)
EC50
1.6±n/a nM
Citation
 Harper, BHWang, LZhu, CKar, NFLi, BMoyes, CRGoble, SDCosta, MDingley, KDi Salvo, JHa, SNHurley, ALi, XMiller, RRNagabukuro, HSalituro, GMSmith, SStruthers, MHale, JJEdmondson, SDBerger, R Investigation of piperazine benzamides as humanß Bioorg Med Chem Lett 27:1094-1098 (2017)  
Target
Name:
Beta-3 adrenergic receptor
Synonyms:
ADRB3 ADRB3_HUMAN Beta-2 adrenergic receptor and beta-3 adrenergic receptor Beta-3 adrenoreceptor | adrenergic Beta3
Type:
G Protein-Coupled Receptor (GPCR)
Mol. Mass.:
43534.88
Organism:
Homo sapiens (Human)
Description:
Residue:
408
  
Inhibitor
Name:
BDBM50235121
Synonyms:
CHEMBL4066314
Type:
Small organic molecule
Emp. Form.:
C28H33F3N6O2
Mol. Mass.:
542.5958
SMILES:
[H][C@@]1(CC[C@@H](Cc2ccc(cc2)C(=O)N2CCN(Cc3ncn(CC(F)(F)F)n3)CC2)N1)[C@H](O)c1ccccc1
: