Target
NAD-dependent protein deacetylase sirtuin-2
Ligand
BDBM50236570
Substrate
Meas. Tech.
ChEMBL_1660309 (CHEMBL4009921)
Ki
2180±n/a nM
Citation
 Moniot, SForgione, MLucidi, AHailu, GSNebbioso, ACarafa, VBaratta, FAltucci, LGiacché, NPasseri, DPellicciari, RMai, ASteegborn, CRotili, D Development of 1,2,4-Oxadiazoles as Potent and Selective Inhibitors of the Human Deacetylase Sirtuin 2: Structure-Activity Relationship, X-ray Crystal Structure, and Anticancer Activity. J Med Chem 60:2344-2360 (2017)  
Target
Name:
NAD-dependent protein deacetylase sirtuin-2
Synonyms:
NAD-Dependent Deacetylase Sirtuin-2 NAD-dependent deacetylase sirtuin 3 SIR2-like SIR2L SIR2_HUMAN Sirtuin 2 (SIRT2)
Type:
Hydrolase
Mol. Mass.:
43172.62
Organism:
Homo sapiens (Human)
Description:
Residue:
389
  
Inhibitor
Name:
BDBM50236570
Synonyms:
CHEMBL4072206
Type:
Small organic molecule
Emp. Form.:
C11H10Br2N2O
Mol. Mass.:
346.018
SMILES:
BrCCCc1nc(no1)-c1ccc(Br)cc1
: