Target
Glutaminase kidney isoform, mitochondrial
Ligand
BDBM50238195
Substrate
Meas. Tech.
ChEMBL_1663491 (CHEMBL4013172)
IC50
151±n/a nM
Citation
 Yeh, TKKuo, CCLee, YZKe, YYChu, KFHsu, HYChang, HYLiu, YWSong, JSYang, CWLin, LMSun, MWu, SHKuo, PCShih, CChen, CTTsou, LKLee, SJ Design, Synthesis, and Evaluation of Thiazolidine-2,4-dione Derivatives as a Novel Class of Glutaminase Inhibitors. J Med Chem 60:5599-5612 (2017)  
Target
Name:
Glutaminase kidney isoform, mitochondrial
Synonyms:
GLS GLSK_HUMAN K-glutaminase L-glutamine amidohydrolase
Type:
Protein
Mol. Mass.:
73471.89
Organism:
Homo sapiens (Human)
Description:
O94925
Residue:
669
  
Inhibitor
Name:
BDBM50238195
Synonyms:
CHEMBL4090687
Type:
Small organic molecule
Emp. Form.:
C36H23N3O4S2
Mol. Mass.:
625.716
SMILES:
O=C1NC(=O)\C(S1)=C\c1cc(-c2ccccc2)n(c1-c1ccccc1)-c1ccc(cc1)-c1ccc(\C=C2/SC(=O)NC2=O)cc1
: