Target
Glutaminase kidney isoform, mitochondrial
Ligand
BDBM50238203
Substrate
Meas. Tech.
ChEMBL_1663491 (CHEMBL4013172)
IC50
255±n/a nM
Citation
 Yeh, TKKuo, CCLee, YZKe, YYChu, KFHsu, HYChang, HYLiu, YWSong, JSYang, CWLin, LMSun, MWu, SHKuo, PCShih, CChen, CTTsou, LKLee, SJ Design, Synthesis, and Evaluation of Thiazolidine-2,4-dione Derivatives as a Novel Class of Glutaminase Inhibitors. J Med Chem 60:5599-5612 (2017)  
Target
Name:
Glutaminase kidney isoform, mitochondrial
Synonyms:
GLS GLSK_HUMAN K-glutaminase L-glutamine amidohydrolase
Type:
Protein
Mol. Mass.:
73471.89
Organism:
Homo sapiens (Human)
Description:
O94925
Residue:
669
  
Inhibitor
Name:
BDBM50238203
Synonyms:
CHEMBL4074218
Type:
Small organic molecule
Emp. Form.:
C26H18ClN3O4S2
Mol. Mass.:
536.022
SMILES:
Cc1cc(\C=C2/SC(=O)NC2=O)c(C)n1-c1ccc(cc1)-c1ccc(\C=C2/SC(=O)NC2=O)c(Cl)c1
: