Target
Glutaminase kidney isoform, mitochondrial
Ligand
BDBM50238194
Substrate
Meas. Tech.
ChEMBL_1663490 (CHEMBL4013171)
IC50
50±n/a nM
Citation
 Yeh, TKKuo, CCLee, YZKe, YYChu, KFHsu, HYChang, HYLiu, YWSong, JSYang, CWLin, LMSun, MWu, SHKuo, PCShih, CChen, CTTsou, LKLee, SJ Design, Synthesis, and Evaluation of Thiazolidine-2,4-dione Derivatives as a Novel Class of Glutaminase Inhibitors. J Med Chem 60:5599-5612 (2017)  
Target
Name:
Glutaminase kidney isoform, mitochondrial
Synonyms:
GLS GLSK_HUMAN K-glutaminase L-glutamine amidohydrolase
Type:
Protein
Mol. Mass.:
73471.89
Organism:
Homo sapiens (Human)
Description:
O94925
Residue:
669
  
Inhibitor
Name:
BDBM50238194
Synonyms:
CHEMBL4080388
Type:
Small organic molecule
Emp. Form.:
C32H19N3O4S4
Mol. Mass.:
637.771
SMILES:
O=C1NC(=O)\C(S1)=C\c1cc(-c2cccs2)n(c1-c1cccs1)-c1ccc(cc1)-c1ccc(\C=C2/SC(=O)NC2=O)cc1
: