Target
Glutaminase kidney isoform, mitochondrial
Ligand
BDBM50238197
Substrate
Meas. Tech.
ChEMBL_1663490 (CHEMBL4013171)
IC50
35±n/a nM
Citation
 Yeh, TKKuo, CCLee, YZKe, YYChu, KFHsu, HYChang, HYLiu, YWSong, JSYang, CWLin, LMSun, MWu, SHKuo, PCShih, CChen, CTTsou, LKLee, SJ Design, Synthesis, and Evaluation of Thiazolidine-2,4-dione Derivatives as a Novel Class of Glutaminase Inhibitors. J Med Chem 60:5599-5612 (2017)  
Target
Name:
Glutaminase kidney isoform, mitochondrial
Synonyms:
GLS GLSK_HUMAN K-glutaminase L-glutamine amidohydrolase
Type:
Protein
Mol. Mass.:
73471.89
Organism:
Homo sapiens (Human)
Description:
O94925
Residue:
669
  
Inhibitor
Name:
BDBM50238197
Synonyms:
CHEMBL4082885
Type:
Small organic molecule
Emp. Form.:
C33H21N3O5S4
Mol. Mass.:
667.797
SMILES:
COc1cc(ccc1-c1ccc(\C=C2/SC(=O)NC2=O)cc1)-n1c(cc(\C=C2/SC(=O)NC2=O)c1-c1cccs1)-c1cccs1
: