Target
Glutaminase kidney isoform, mitochondrial
Ligand
BDBM50238202
Substrate
Meas. Tech.
ChEMBL_1663490 (CHEMBL4013171)
IC50
247±n/a nM
Citation
 Yeh, TKKuo, CCLee, YZKe, YYChu, KFHsu, HYChang, HYLiu, YWSong, JSYang, CWLin, LMSun, MWu, SHKuo, PCShih, CChen, CTTsou, LKLee, SJ Design, Synthesis, and Evaluation of Thiazolidine-2,4-dione Derivatives as a Novel Class of Glutaminase Inhibitors. J Med Chem 60:5599-5612 (2017)  
Target
Name:
Glutaminase kidney isoform, mitochondrial
Synonyms:
GLS GLSK_HUMAN K-glutaminase L-glutamine amidohydrolase
Type:
Protein
Mol. Mass.:
73471.89
Organism:
Homo sapiens (Human)
Description:
O94925
Residue:
669
  
Inhibitor
Name:
BDBM50238202
Synonyms:
CHEMBL4087025
Type:
Small organic molecule
Emp. Form.:
C26H19N3O5S2
Mol. Mass.:
517.576
SMILES:
Cc1cc(\C=C2/SC(=O)NC2=O)c(C)n1-c1ccc(c(O)c1)-c1ccc(\C=C2/SC(=O)NC2=O)cc1
: