Target
Glutaminase liver isoform, mitochondrial
Ligand
BDBM50238197
Substrate
Meas. Tech.
ChEMBL_1663489 (CHEMBL4013170)
IC50
269±n/a nM
Citation
 Yeh, TKKuo, CCLee, YZKe, YYChu, KFHsu, HYChang, HYLiu, YWSong, JSYang, CWLin, LMSun, MWu, SHKuo, PCShih, CChen, CTTsou, LKLee, SJ Design, Synthesis, and Evaluation of Thiazolidine-2,4-dione Derivatives as a Novel Class of Glutaminase Inhibitors. J Med Chem 60:5599-5612 (2017)  
Target
Name:
Glutaminase liver isoform, mitochondrial
Synonyms:
3.5.1.2 GLS GLSL_HUMAN L-glutaminase | L-glutamine amidohydrolase
Type:
PROTEIN
Mol. Mass.:
66331.64
Organism:
Homo sapiens
Description:
ChEMBL_117753
Residue:
602
  
Inhibitor
Name:
BDBM50238197
Synonyms:
CHEMBL4082885
Type:
Small organic molecule
Emp. Form.:
C33H21N3O5S4
Mol. Mass.:
667.797
SMILES:
COc1cc(ccc1-c1ccc(\C=C2/SC(=O)NC2=O)cc1)-n1c(cc(\C=C2/SC(=O)NC2=O)c1-c1cccs1)-c1cccs1
: