Target
Glutaminase liver isoform, mitochondrial
Ligand
BDBM50238209
Substrate
Meas. Tech.
ChEMBL_1663489 (CHEMBL4013170)
IC50
1031±n/a nM
Citation
 Yeh, TKKuo, CCLee, YZKe, YYChu, KFHsu, HYChang, HYLiu, YWSong, JSYang, CWLin, LMSun, MWu, SHKuo, PCShih, CChen, CTTsou, LKLee, SJ Design, Synthesis, and Evaluation of Thiazolidine-2,4-dione Derivatives as a Novel Class of Glutaminase Inhibitors. J Med Chem 60:5599-5612 (2017)  
Target
Name:
Glutaminase liver isoform, mitochondrial
Synonyms:
3.5.1.2 GLS GLSL_HUMAN L-glutaminase | L-glutamine amidohydrolase
Type:
PROTEIN
Mol. Mass.:
66331.64
Organism:
Homo sapiens
Description:
ChEMBL_117753
Residue:
602
  
Inhibitor
Name:
BDBM50238209
Synonyms:
CHEMBL4072390
Type:
Small organic molecule
Emp. Form.:
C28H23N3O4S2
Mol. Mass.:
529.63
SMILES:
CCc1cc(ccc1\C=C1/SC(=O)NC1=O)-c1ccc(cc1)-n1c(C)cc(\C=C2/SC(=O)NC2=O)c1C
: