Target
Glutaminase kidney isoform, mitochondrial
Ligand
BDBM50238207
Substrate
Meas. Tech.
ChEMBL_1663490 (CHEMBL4013171)
IC50
754±n/a nM
Citation
 Yeh, TKKuo, CCLee, YZKe, YYChu, KFHsu, HYChang, HYLiu, YWSong, JSYang, CWLin, LMSun, MWu, SHKuo, PCShih, CChen, CTTsou, LKLee, SJ Design, Synthesis, and Evaluation of Thiazolidine-2,4-dione Derivatives as a Novel Class of Glutaminase Inhibitors. J Med Chem 60:5599-5612 (2017)  
Target
Name:
Glutaminase kidney isoform, mitochondrial
Synonyms:
GLS GLSK_HUMAN K-glutaminase L-glutamine amidohydrolase
Type:
Protein
Mol. Mass.:
73471.89
Organism:
Homo sapiens (Human)
Description:
O94925
Residue:
669
  
Inhibitor
Name:
BDBM50238207
Synonyms:
CHEMBL4100814
Type:
Small organic molecule
Emp. Form.:
C22H13BrN2O2S3
Mol. Mass.:
513.45
SMILES:
Brc1ccc(cc1)-n1c(cc(\C=C2/SC(=O)NC2=O)c1-c1cccs1)-c1cccs1
: