Target
Glutaminase kidney isoform, mitochondrial
Ligand
BDBM50238210
Substrate
Meas. Tech.
ChEMBL_1663490 (CHEMBL4013171)
IC50
59±n/a nM
Citation
 Yeh, TKKuo, CCLee, YZKe, YYChu, KFHsu, HYChang, HYLiu, YWSong, JSYang, CWLin, LMSun, MWu, SHKuo, PCShih, CChen, CTTsou, LKLee, SJ Design, Synthesis, and Evaluation of Thiazolidine-2,4-dione Derivatives as a Novel Class of Glutaminase Inhibitors. J Med Chem 60:5599-5612 (2017)  
Target
Name:
Glutaminase kidney isoform, mitochondrial
Synonyms:
GLS GLSK_HUMAN K-glutaminase L-glutamine amidohydrolase
Type:
Protein
Mol. Mass.:
73471.89
Organism:
Homo sapiens (Human)
Description:
O94925
Residue:
669
  
Inhibitor
Name:
BDBM50238210
Synonyms:
CHEMBL4065595
Type:
Small organic molecule
Emp. Form.:
C29H22N4O4S2
Mol. Mass.:
554.639
SMILES:
CCc1cc(ccc1\C=C1/SC(=O)NC1=O)-c1ccc(cc1C#N)-n1c(C)cc(\C=C2/SC(=O)NC2=O)c1C
: