Target
Glutaminase kidney isoform, mitochondrial
Ligand
BDBM50400050
Substrate
Meas. Tech.
ChEMBL_1663490 (CHEMBL4013171)
IC50
81±n/a nM
Citation
 Yeh, TKKuo, CCLee, YZKe, YYChu, KFHsu, HYChang, HYLiu, YWSong, JSYang, CWLin, LMSun, MWu, SHKuo, PCShih, CChen, CTTsou, LKLee, SJ Design, Synthesis, and Evaluation of Thiazolidine-2,4-dione Derivatives as a Novel Class of Glutaminase Inhibitors. J Med Chem 60:5599-5612 (2017)  
Target
Name:
Glutaminase kidney isoform, mitochondrial
Synonyms:
GLS GLSK_HUMAN K-glutaminase L-glutamine amidohydrolase
Type:
Protein
Mol. Mass.:
73471.89
Organism:
Homo sapiens (Human)
Description:
O94925
Residue:
669
  
Inhibitor
Name:
BDBM50400050
Synonyms:
CHEMBL2177757 US11191732, Example BPTES US9938267, Cmpd ID 1
Type:
Small organic molecule
Emp. Form.:
C24H24N6O2S3
Mol. Mass.:
524.681
SMILES:
O=C(Cc1ccccc1)Nc1nnc(CCSCCc2nnc(NC(=O)Cc3ccccc3)s2)s1
: