Target
Glutaminase liver isoform, mitochondrial
Ligand
BDBM50238205
Substrate
Meas. Tech.
ChEMBL_1663489 (CHEMBL4013170)
IC50
1188±n/a nM
Citation
 Yeh, TKKuo, CCLee, YZKe, YYChu, KFHsu, HYChang, HYLiu, YWSong, JSYang, CWLin, LMSun, MWu, SHKuo, PCShih, CChen, CTTsou, LKLee, SJ Design, Synthesis, and Evaluation of Thiazolidine-2,4-dione Derivatives as a Novel Class of Glutaminase Inhibitors. J Med Chem 60:5599-5612 (2017)  
Target
Name:
Glutaminase liver isoform, mitochondrial
Synonyms:
3.5.1.2 GLS GLSL_HUMAN L-glutaminase | L-glutamine amidohydrolase
Type:
PROTEIN
Mol. Mass.:
66331.64
Organism:
Homo sapiens
Description:
ChEMBL_117753
Residue:
602
  
Inhibitor
Name:
BDBM50238205
Synonyms:
CHEMBL4098413
Type:
Small organic molecule
Emp. Form.:
C26H19N3O4S2
Mol. Mass.:
501.577
SMILES:
Cc1cc(\C=C2/SC(=O)NC2=O)c(C)n1-c1ccc(cc1)-c1ccc(\C=C2/SC(=O)NC2=O)cc1
: