Target
Sodium-dependent noradrenaline transporter
Ligand
BDBM50080827
Substrate
Ki
1800±n/a nM
Comments
PDSP_3768
Citation
 Miller, DKCrooks, PAZheng, GGrinevich, VPNorrholm, SDDwoskin, LP Lobeline analogs with enhanced affinity and selectivity for plasmalemma and vesicular monoamine transporters. J Pharmacol Exp Ther 310:1035-45 (2004)  
Target
Name:
Sodium-dependent noradrenaline transporter
Synonyms:
Monoamine transporter NET Noradrenaline Transporter (NET) Norepinephrine transporter protein (NET) SLC6A2 Sodium-dependent noradrenaline transporter (NET) | Solute carrier family 6 member 2
Type:
Multi-pass membrane protein
Mol. Mass.:
69337.72
Organism:
Homo sapiens (Human)
Description:
P23975
Residue:
617
  
Inhibitor
Name:
BDBM50080827
Synonyms:
(2R,6S)-1-Methyl-2,6-diphenethyl-piperidine CHEMBL1085811 Lobelane | cis-N-methyl-2,6-diphenethylpiperidine
Type:
Small organic molecule
Emp. Form.:
C22H29N
Mol. Mass.:
307.4724
SMILES:
CN1[C@@H](CCc2ccccc2)CCC[C@H]1CCc1ccccc1
: