Target
Sodium-dependent noradrenaline transporter
Ligand
BDBM50047021
Substrate
Ki
1870±n/a nM
Comments
PDSP_1085
Citation
 Miller, DKCrooks, PAZheng, GGrinevich, VPNorrholm, SDDwoskin, LP Lobeline analogs with enhanced affinity and selectivity for plasmalemma and vesicular monoamine transporters. J Pharmacol Exp Ther 310:1035-45 (2004)  
Target
Name:
Sodium-dependent noradrenaline transporter
Synonyms:
Monoamine transporter NET Noradrenaline Transporter (NET) Norepinephrine transporter protein (NET) SLC6A2 Sodium-dependent noradrenaline transporter (NET) | Solute carrier family 6 member 2
Type:
Multi-pass membrane protein
Mol. Mass.:
69337.72
Organism:
Homo sapiens (Human)
Description:
P23975
Residue:
617
  
Inhibitor
Name:
BDBM50047021
Synonyms:
2-(6-(2-hydroxy-2-phenylethyl)-1-methylpiperidin-2-yl)-1-phenylethanone 2-[6-(2-Hydroxy-2-phenyl-ethyl)-1-methyl-piperidin-2-yl]-1-phenyl-ethanone (lobeline) Lobeline Lobeline,Alpha
Type:
Small organic molecule
Emp. Form.:
C22H27NO2
Mol. Mass.:
337.4553
SMILES:
CN1C(CC(O)c2ccccc2)CCCC1CC(=O)c1ccccc1
: