Target
Sodium-dependent noradrenaline transporter
Ligand
BDBM50171941
Substrate
Ki
277±n/a nM
Comments
PDSP_3770
Citation
 Miller, DKCrooks, PAZheng, GGrinevich, VPNorrholm, SDDwoskin, LP Lobeline analogs with enhanced affinity and selectivity for plasmalemma and vesicular monoamine transporters. J Pharmacol Exp Ther 310:1035-45 (2004)  
Target
Name:
Sodium-dependent noradrenaline transporter
Synonyms:
Monoamine transporter NET Noradrenaline Transporter (NET) Norepinephrine transporter protein (NET) SLC6A2 Sodium-dependent noradrenaline transporter (NET) | Solute carrier family 6 member 2
Type:
Multi-pass membrane protein
Mol. Mass.:
69337.72
Organism:
Homo sapiens (Human)
Description:
P23975
Residue:
617
  
Inhibitor
Name:
BDBM50171941
Synonyms:
(2R,6S)-1-Methyl-2,6-bis-((E)-styryl)-piperidine mesotransdiene
Type:
Small organic molecule
Emp. Form.:
C22H25N
Mol. Mass.:
303.4406
SMILES:
CN1[C@@H](CCC[C@@H]1\C=C\c1ccccc1)\C=C\c1ccccc1
: