Target
Interleukin-1 receptor-associated kinase 4
Ligand
BDBM278799
Substrate
Meas. Tech.
IRAK4 Kinase Assay
pH
7.2±n/a
IC50
1367±n/a nM
Comments
extracted
Citation
 Lim, JAltman, MDBrubaker, JDGibeau, CR Pyrrolopyridazine inhibitors of IRAK4 activity US Patent  US10040798 Publication Date 8/7/2018 
Target
Name:
Interleukin-1 receptor-associated kinase 4
Synonyms:
IRAK-4 IRAK4_HUMAN Interleukin-1 receptor-associated kinase 4 (IRAK4) | Renal carcinoma antigen NY-REN-64
Type:
Protein
Mol. Mass.:
51519.08
Organism:
Homo sapiens (Human)
Description:
Q9NWZ3
Residue:
460
  
Inhibitor
Name:
BDBM278799
Synonyms:
N-(2-cyanothiophen-3- yl)-2-{[(1R,2S)-2- hydroxycyclohexyl] amino}pyrrolo[1,2- b]pyridazine-7- carboxamide trifluoroacetate | US10040798, Example 97
Type:
Small organic molecule
Emp. Form.:
C21H20F3N5O4S
Mol. Mass.:
495.475
SMILES:
OC(=O)C(F)(F)F.O[C@H]1CCCC[C@H]1Nc1ccc2ccc(C(=O)Nc3ccsc3C#N)n2n1
: