Target
Envelope glycoprotein gp160
Ligand
BDBM279274
Substrate
Meas. Tech.
Infectivity Assay
EC50
550±n/a nM
Citation
 Pendri, ALi, GBender, JAYang, ZWang, AXBeno, BRFridell, RABelema, MMeanwell, NAGentles, RG Inhibitors of human immunodeficiency virus replication US Patent  US10035760 Publication Date 7/31/2018 
Target
Name:
Envelope glycoprotein gp160
Synonyms:
Env polyprotein | NL4-3
Type:
Enzyme Catalytic Domain
Mol. Mass.:
97031.14
Organism:
Human immunodeficiency virus type 1 (isolate BRU/LAI group M subtypeB) (HIV-1)
Description:
Residue:
854
  
Inhibitor
Name:
BDBM279274
Synonyms:
US10035760, Example 99
Type:
Small organic molecule
Emp. Form.:
C24H21F2N3O6S
Mol. Mass.:
517.502
SMILES:
CN(C(=O)[C@H](Cc1ccccc1)NC(=O)NS(=O)(=O)c1cc(F)ccc1F)c1ccc2OCOc2c1
: