Target
Acyl-protein thioesterase 1
Ligand
BDBM92728
Substrate
Meas. Tech.
Enzymatic Protein Activity Assay
IC50
3.36e+4± 4.6e+3 nM
Citation
 Zimmermann, TJBürger, MTashiro, EKondoh, YMartinez, NEGörmer, KRosin-Steiner, SShimizu, TOzaki, SMikoshiba, KWatanabe, NHall, DVetter, IROsada, HHedberg, CWaldmann, H Boron-based inhibitors of acyl protein thioesterases 1 and 2. Chembiochem 14:115-22 (2013)  
Target
Name:
Acyl-protein thioesterase 1
Synonyms:
APT-1 Acyl-protein thioesterase 1 (APT1 WT) LPL1 LYPLA1 Lysophospholipase 1 hAPT1
Type:
Protein
Mol. Mass.:
24670.33
Organism:
Homo sapiens (Human)
Description:
O75608
Residue:
230
  
Inhibitor
Name:
BDBM92728
Synonyms:
Phenylboronic acid, 7
Type:
Small molecule
Emp. Form.:
C26H24B2O3
Mol. Mass.:
406.089
SMILES:
OB(c1ccccc1)c1cccc(COCc2cccc(c2)B(O)c2ccccc2)c1
: