Target
Hepatocyte growth factor receptor
Ligand
BDBM99228
Substrate
Meas. Tech.
Time-Resolved Fluorescence Resonance Energy Transfer (TR-FRET) Assay
IC50
0.4±0.0 nM
Citation
 He, FDai, MFu, XLi, YLiu, LMi, YXu, YXun, GYu, ZZhang, JY Heterocyclic hydrazone compounds US Patent  US8497368 Publication Date 7/30/2013 
Target
Name:
Hepatocyte growth factor receptor
Synonyms:
Hepatocyte growth factor receptor Hepatocyte growth factor receptor (c-MET) MET Met proto-oncogene (hepatocyte growth factor receptor) Tyrosine-protein kinase Met (c-Met) c-Met kinase
Type:
Protein
Mol. Mass.:
155559.73
Organism:
Homo sapiens (Human)
Description:
P08581
Residue:
1390
  
Inhibitor
Name:
BDBM99228
Synonyms:
US8497368, 20
Type:
Small organic molecule
Emp. Form.:
C19H15F2N7O
Mol. Mass.:
395.3655
SMILES:
CC(=NNC(N)=O)c1ccc2ncc(Cc3c(F)cc4ncccc4c3F)n2n1
: