Target
Epoxide hydrolase 1
Ligand
BDBM2211
Substrate
Meas. Tech.
Inhibition Assay
IC50
1.5±0.0 nM
Citation
 Hammock, BDJones, PDMorisseau, CHuang, HTsai, HGless, Jr., R Conformationally restricted urea inhibitors of soluble epoxide hydrolase US Patent  US8501783 Publication Date 8/6/2013 
Target
Name:
Epoxide hydrolase 1
Synonyms:
EPHX EPOX Epoxide hydrolase (HsEH) HYEP_HUMAN | Microsomal epoxide hydrolase
Type:
Protein
Mol. Mass.:
52954.28
Organism:
Homo sapiens (Human)
Description:
P07099
Residue:
455
  
Inhibitor
Name:
BDBM2211
Synonyms:
US8501783, 1204 | US8501783, 1211
Type:
Emp. Form.:
C26H35N3O4
Mol. Mass.:
453.5738
SMILES:
COC(=O)c1ccc(cc1)C(=O)N1CCC(CNC(=O)NC23CC4CC(CC(C4)C2)C3)CC1
: