Target
Lysine-specific histone demethylase 1A
Ligand
BDBM101278
Substrate
Meas. Tech.
Biological Assay
Ki
17±n/a nM
Citation
 Guibourt, NMunoz, AOLaria, JC Oxidase inhibitors and their use US Patent  US8524717 Publication Date 9/3/2013 
Target
Name:
Lysine-specific histone demethylase 1A
Synonyms:
AOF2 Flavin-containing amine oxidase domain-containing protein 2 KDM1A KIAA0601 Lysine-specific demethylase 1 (LSD1) Lysine-specific histone demethylase 1 (LSD1)
Type:
Enzyme
Mol. Mass.:
92901.01
Organism:
Homo sapiens (Human)
Description:
O60341
Residue:
852
  
Inhibitor
Name:
BDBM101278
Synonyms:
US8524717, 33
Type:
Small organic molecule
Emp. Form.:
C24H28N4O2
Mol. Mass.:
404.5047
SMILES:
CN1CCN(CC1)C(=O)CN[C@H]1C[C@@H]1c1ccc(OCc2ccc(cc2)[N+]#[C-])cc1
: