Target
Substance-K receptor
Ligand
BDBM50112244
Substrate
Meas. Tech.
Selectivity Assay with Human NK-2
pH
7.4±n/a
Temperature
298.15±n/a K
Ki
>30000±n/a nM
Comments
extracted
Citation
 Hoveyda, HDutheuil, GFraser, G Substituted [1,2,4]triazolo[4,3-a]pyrazines as selective NK-3 receptor antagonists US Patent  US10030025 Publication Date 7/24/2018 
Target
Name:
Substance-K receptor
Synonyms:
NK-2 receptor NK2R NKNAR Neurokinin A receptor Neurokinin-2 (NK-2) SKR TACR2 Tachykinin receptor 2 (NK2) | hnk-3
Type:
Protein
Mol. Mass.:
44455.78
Organism:
Homo sapiens (Human)
Description:
P21452
Residue:
398
  
Inhibitor
Name:
BDBM50112244
Synonyms:
CHEMBL3608680 US10836768, Cpd no 5 US9422299, 5 | US9987274, Compound 5
Type:
Small organic molecule
Emp. Form.:
C16H15FN6OS
Mol. Mass.:
358.393
SMILES:
C[C@H]1N(CCn2c1nnc2-c1nc(C)ns1)C(=O)c1ccc(F)cc1
: