Target
Sentrin-specific protease 1
Ligand
BDBM103833
Substrate
SUMO1
Meas. Tech.
SUMO Cleavage Assay
pH
7.4±0
IC50
>6.0e+7±n/a nM
Citation
 Madu, IGNamanja, ATSu, YWong, SLi, YJChen, Y Identification and Characterization of a New Chemotype of Noncovalent SENP Inhibitors. ACS Chem Biol 8:1435-41 (2013)  
Target
Name:
Sentrin-specific protease 1
Synonyms:
SENP1 Sentrin-specific protease 1 (SENP1)
Type:
Protein
Mol. Mass.:
73500.42
Organism:
Homo sapiens (Human)
Description:
Q9P0U3
Residue:
644
  
Inhibitor
Name:
BDBM103833
Synonyms:
SPI-08 US9791447, Compound SPI-08
Type:
Small organic molecule
Emp. Form.:
C16H12N3O3S
Mol. Mass.:
326.35
SMILES:
Nc1c(cc(c2ccccc12)S([O-])(=O)=O)\N=N\c1ccccc1
:
Substrate
Name:
Small ubiquitin-related modifier 1
Synonyms:
SMT3C SUMO1 Small ubiquitin-related modifier 1 | UBL1
Type:
Protein
Mol. Mass.:
11553.84
Organism:
Homo sapiens (Human)
Description:
Residue:
101