Target
Sentrin-specific protease 2
Ligand
BDBM103827
Substrate
SUMO1
Meas. Tech.
SUMO Cleavage Assay
pH
7.4±0
IC50
3.42e+3± 1.6e+3 nM
Citation
 Madu, IGNamanja, ATSu, YWong, SLi, YJChen, Y Identification and Characterization of a New Chemotype of Noncovalent SENP Inhibitors. ACS Chem Biol 8:1435-41 (2013)  
Target
Name:
Sentrin-specific protease 2
Synonyms:
KIAA1331 SENP2_HUMAN | Sentrin-specific protease 2 (SENP2)
Type:
Protein
Mol. Mass.:
67890.62
Organism:
Homo sapiens (Human)
Description:
Q9HC62
Residue:
589
  
Inhibitor
Name:
BDBM103827
Synonyms:
SPI-02 US9791447, Compound SPI-02
Type:
Small organic molecule
Emp. Form.:
C34H28N6O9S3
Mol. Mass.:
760.816
SMILES:
Cc1cc(ccc1\N=N\c1c(N)ccc2cc(ccc12)S(O)(=O)=O)-c1ccc(\N=N\c2c(N)c(cc3cc(ccc23)S(O)(=O)=O)S(O)(=O)=O)c(C)c1
:
Substrate
Name:
Small ubiquitin-related modifier 1
Synonyms:
SMT3C SUMO1 Small ubiquitin-related modifier 1 | UBL1
Type:
Protein
Mol. Mass.:
11553.84
Organism:
Homo sapiens (Human)
Description:
Residue:
101