Target
Sentrin-specific protease 1
Ligand
BDBM103834
Substrate
SUMO2
Meas. Tech.
SUMO Cleavage Assay
pH
7.4±0
IC50
>6.0e+4±n/a nM
Citation
 Madu, IGNamanja, ATSu, YWong, SLi, YJChen, Y Identification and Characterization of a New Chemotype of Noncovalent SENP Inhibitors. ACS Chem Biol 8:1435-41 (2013)  
Target
Name:
Sentrin-specific protease 1
Synonyms:
SENP1 Sentrin-specific protease 1 (SENP1)
Type:
Protein
Mol. Mass.:
73500.42
Organism:
Homo sapiens (Human)
Description:
Q9P0U3
Residue:
644
  
Inhibitor
Name:
BDBM103834
Synonyms:
SPI-09 US9791447, Compound SPI-09
Type:
Small organic molecule
Emp. Form.:
C16H13N3O9S3
Mol. Mass.:
487.484
SMILES:
Nc1ccc2cc(cc(c2c1\N=N\c1ccc(cc1)S(O)(=O)=O)S(O)(=O)=O)S(O)(=O)=O
:
Substrate
Name:
Small ubiquitin-related modifier 2
Synonyms:
SMT3B SUMO2 Small ubiquitin-related modifier 2
Type:
Protein
Mol. Mass.:
10869.09
Organism:
Homo sapiens (Human)
Description:
Residue:
95