Target
Sentrin-specific protease 2
Ligand
BDBM103830
Substrate
SUMO2
Meas. Tech.
SUMO Cleavage Assay
pH
7.4±0
IC50
4.6e+3± 1.65e+3 nM
Citation
 Madu, IGNamanja, ATSu, YWong, SLi, YJChen, Y Identification and Characterization of a New Chemotype of Noncovalent SENP Inhibitors. ACS Chem Biol 8:1435-41 (2013)  
Target
Name:
Sentrin-specific protease 2
Synonyms:
KIAA1331 SENP2_HUMAN | Sentrin-specific protease 2 (SENP2)
Type:
Protein
Mol. Mass.:
67890.62
Organism:
Homo sapiens (Human)
Description:
Q9HC62
Residue:
589
  
Inhibitor
Name:
BDBM103830
Synonyms:
SPI-05 US9791447, Compound SPI-05
Type:
Small organic molecule
Emp. Form.:
C34H26N6O6S2
Mol. Mass.:
678.737
SMILES:
Nc1ccc(\N=N\c2ccc(\C=C\c3ccc(cc3S(O)(=O)=O)\N=N\c3ccc(N)c4ccccc34)c(c2)S(O)(=O)=O)c2ccccc12
:
Substrate
Name:
Small ubiquitin-related modifier 2
Synonyms:
SMT3B SUMO2 Small ubiquitin-related modifier 2
Type:
Protein
Mol. Mass.:
10869.09
Organism:
Homo sapiens (Human)
Description:
Residue:
95