Target
Carbonic anhydrase 2
Ligand
BDBM103910
Substrate
Meas. Tech.
Enzyme Inhibition Assay
pH
7.4±0
Temperature
298.15±0 K
IC50
652±0.0 nM
Citation
 Babich, JWZimmerman, CJoyal, JMaresca, KPMarquis, JLu, GWang, JHillier, S Technetium- and rhenium-bis(heteroaryl) complexes and methods of use thereof US Patent  US8562945 Publication Date 10/22/2013 
Target
Name:
Carbonic anhydrase 2
Synonyms:
CA-II CAC Carbonate dehydratase II Carbonic anhydrase 2 (CA-II) Carbonic anhydrase C Carbonic anhydrase II (CA-II) Carbonic anhydrase II (hCA II) | Carbonic anhydrase isoenzyme II (hCA II)
Type:
Enzyme
Mol. Mass.:
29250.71
Organism:
Homo sapiens (Human)
Description:
P00918
Residue:
260
  
Inhibitor
Name:
BDBM103910
Synonyms:
JNK3 inhibitor 7 | US8562945, 243
Type:
Small organic molecule
Emp. Form.:
C18H24N6O2ReS
Mol. Mass.:
574.694
SMILES:
CN1C=C[N]2=C1C[N]1(CCc3ccc(SOON)cc3)CC3=[N](C=CN3C)[Re+]21
: