Target
Mitogen-activated protein kinase 10
Ligand
BDBM16018
Substrate
IC50
220±42 nM
Citation
 Feng, YChambers, JWIqbal, SKoenig, MPark, HCherry, LHernandez, PFiguera-Losada, MLoGrasso, PV A small molecule bidentate-binding dual inhibitor probe of the LRRK2 and JNK kinases. ACS Chem Biol 8:1747-54 (2013)  
Target
Name:
Mitogen-activated protein kinase 10
Synonyms:
JNK3 MAP kinase p49 3F12 MK10_HUMAN Mitogen-activated protein kinase 10 (Stress-activated protein kinase JNK3) (c-Jun N-terminal kinase 3) (MAP kinase p49 3F12) PRKM10 Stress-activated protein kinase JNK3 | c-Jun N-terminal kinase 3 (JNK3)
Type:
Enzyme
Mol. Mass.:
52586.89
Organism:
Homo sapiens (Human)
Description:
Residue:
464
  
Inhibitor
Name:
BDBM16018
Synonyms:
14,15-diazatetracyclo[7.6.1.0^{2,7}.0^{13,16}]hexadeca-1(15),2(7),3,5,9(16),10,12-heptaen-8-one ChemBiol10705 Compound 4 SP 600125 SP600125 dibenzo[cd,g]indazol-6(2H)-one
Type:
Small organic molecule
Emp. Form.:
C14H8N2O
Mol. Mass.:
220.2261
SMILES:
O=C1c2ccccc2-c2n[nH]c3cccc1c23
: