Target
Histamine H3 receptor
Ligand
BDBM108272
Substrate
Meas. Tech.
Radioligand Binding Assay
Ki
0.8±0.0 nM
Citation
 Gao, ZHall, DHartung, R Substituted piperidine spiro pyrrolidinone and piperidinone, preparation and therapeutic use thereof US Patent  US8604046 Publication Date 12/10/2013 
Target
Name:
Histamine H3 receptor
Synonyms:
Type:
Enzyme
Mol. Mass.:
43426.88
Organism:
Macaca mulatta (Rhesus macaque)
Description:
G7N499
Residue:
390
  
Inhibitor
Name:
BDBM108272
Synonyms:
US8604046, 52
Type:
Small organic molecule
Emp. Form.:
C30H46N4O
Mol. Mass.:
478.7124
SMILES:
C[C@H]1CCCN1[C@H]1CCN(C1)c1ccc(N2CCC3(CCN(CC4CCCC4)CC3)C2=O)c(C)c1
: