Target
Histamine H3 receptor
Ligand
BDBM108299
Substrate
Meas. Tech.
Radioligand Binding Assay
Ki
0.3±0.0 nM
Citation
 Gao, ZHall, DHartung, R Substituted piperidine spiro pyrrolidinone and piperidinone, preparation and therapeutic use thereof US Patent  US8604046 Publication Date 12/10/2013 
Target
Name:
Histamine H3 receptor
Synonyms:
Type:
Enzyme
Mol. Mass.:
43426.88
Organism:
Macaca mulatta (Rhesus macaque)
Description:
G7N499
Residue:
390
  
Inhibitor
Name:
BDBM108299
Synonyms:
US8604046, 79
Type:
Small organic molecule
Emp. Form.:
C29H43FN4O3
Mol. Mass.:
514.6751
SMILES:
C[C@H]1CCCN1C1CCN(CC1)c1ccc(N2CCC3(CCN(CC3)C(=O)OC(C)(C)C)C2=O)c(F)c1
: