Target
Histamine H3 receptor
Ligand
BDBM108300
Substrate
Meas. Tech.
Radioligand Binding Assay
Ki
5.6±0.0 nM
Citation
 Gao, ZHall, DHartung, R Substituted piperidine spiro pyrrolidinone and piperidinone, preparation and therapeutic use thereof US Patent  US8604046 Publication Date 12/10/2013 
Target
Name:
Histamine H3 receptor
Synonyms:
Type:
Enzyme
Mol. Mass.:
43426.88
Organism:
Macaca mulatta (Rhesus macaque)
Description:
G7N499
Residue:
390
  
Inhibitor
Name:
BDBM108300
Synonyms:
US8604046, 80
Type:
Small organic molecule
Emp. Form.:
C29H44N4O3
Mol. Mass.:
496.6847
SMILES:
C[C@H]1CCCCN1[C@H]1CCN(C1)c1ccc(cc1)N1CCC2(CCN(CC2)C(=O)OC(C)(C)C)C1=O
: