Target
Histamine H3 receptor
Ligand
BDBM108304
Substrate
Meas. Tech.
Radioligand Binding Assay
Ki
0.15±0.0 nM
Citation
 Gao, ZHall, DHartung, R Substituted piperidine spiro pyrrolidinone and piperidinone, preparation and therapeutic use thereof US Patent  US8604046 Publication Date 12/10/2013 
Target
Name:
Histamine H3 receptor
Synonyms:
Type:
Enzyme
Mol. Mass.:
43426.88
Organism:
Macaca mulatta (Rhesus macaque)
Description:
G7N499
Residue:
390
  
Inhibitor
Name:
BDBM108304
Synonyms:
US8604046, 84
Type:
Small organic molecule
Emp. Form.:
C25H35F3N4O
Mol. Mass.:
464.5668
SMILES:
C[C@H]1CCCN1C1CCN(CC1)c1ccc(N2CCC3(CCNCC3)C2=O)c(c1)C(F)(F)F
: