Target
Histamine H3 receptor
Ligand
BDBM108309
Substrate
Meas. Tech.
Radioligand Binding Assay
Ki
0.24±0.0 nM
Citation
 Gao, ZHall, DHartung, R Substituted piperidine spiro pyrrolidinone and piperidinone, preparation and therapeutic use thereof US Patent  US8604046 Publication Date 12/10/2013 
Target
Name:
Histamine H3 receptor
Synonyms:
Type:
Enzyme
Mol. Mass.:
43426.88
Organism:
Macaca mulatta (Rhesus macaque)
Description:
G7N499
Residue:
390
  
Inhibitor
Name:
BDBM108309
Synonyms:
US8604046, 89
Type:
Small organic molecule
Emp. Form.:
C30H40N4O3S
Mol. Mass.:
536.729
SMILES:
C[C@H]1CCCN1C1CCN(CC1)c1ccc(cc1)N1CCC2(CCN(CC2)S(=O)(=O)c2ccccc2)C1=O
: