Target
Histamine H3 receptor
Ligand
BDBM108311
Substrate
Meas. Tech.
Radioligand Binding Assay
Ki
0.2±0.0 nM
Citation
 Gao, ZHall, DHartung, R Substituted piperidine spiro pyrrolidinone and piperidinone, preparation and therapeutic use thereof US Patent  US8604046 Publication Date 12/10/2013 
Target
Name:
Histamine H3 receptor
Synonyms:
Type:
Enzyme
Mol. Mass.:
43426.88
Organism:
Macaca mulatta (Rhesus macaque)
Description:
G7N499
Residue:
390
  
Inhibitor
Name:
BDBM108311
Synonyms:
US8604046, 91
Type:
Small organic molecule
Emp. Form.:
C31H45FN4O2
Mol. Mass.:
524.713
SMILES:
C[C@H]1CCCN1C1CCN(CC1)c1ccc(N2CCC3(CCN(CC3)C(=O)C3CCCCC3)C2=O)c(F)c1
: