Target
Histamine H3 receptor
Ligand
BDBM108313
Substrate
Meas. Tech.
Radioligand Binding Assay
Ki
3.3±0.0 nM
Citation
 Gao, ZHall, DHartung, R Substituted piperidine spiro pyrrolidinone and piperidinone, preparation and therapeutic use thereof US Patent  US8604046 Publication Date 12/10/2013 
Target
Name:
Histamine H3 receptor
Synonyms:
Type:
Enzyme
Mol. Mass.:
43426.88
Organism:
Macaca mulatta (Rhesus macaque)
Description:
G7N499
Residue:
390
  
Inhibitor
Name:
BDBM108313
Synonyms:
US8604046, 93
Type:
Small organic molecule
Emp. Form.:
C30H44N4O3
Mol. Mass.:
508.6954
SMILES:
C[C@H]1CCCCN1[C@H]1CCN(C1)c1ccc(cc1)N1CCC2(CCN(CC2)C(=O)C2CCOCC2)C1=O
: