Target
Histamine H3 receptor
Ligand
BDBM108314
Substrate
Meas. Tech.
Radioligand Binding Assay
Ki
2.1±0.0 nM
Citation
 Gao, ZHall, DHartung, R Substituted piperidine spiro pyrrolidinone and piperidinone, preparation and therapeutic use thereof US Patent  US8604046 Publication Date 12/10/2013 
Target
Name:
Histamine H3 receptor
Synonyms:
Type:
Enzyme
Mol. Mass.:
43426.88
Organism:
Macaca mulatta (Rhesus macaque)
Description:
G7N499
Residue:
390
  
Inhibitor
Name:
BDBM108314
Synonyms:
US8604046, 94
Type:
Small organic molecule
Emp. Form.:
C31H43F3N4O2
Mol. Mass.:
560.6939
SMILES:
C[C@H]1CCCCN1[C@H]1CCN(C1)c1ccc(N2CCC3(CCN(CC3)C(=O)C3CCCC3)C2=O)c(c1)C(F)(F)F
: