Target
Histamine H3 receptor
Ligand
BDBM108318
Substrate
Meas. Tech.
Radioligand Binding Assay
Ki
4.6±0.0 nM
Citation
 Gao, ZHall, DHartung, R Substituted piperidine spiro pyrrolidinone and piperidinone, preparation and therapeutic use thereof US Patent  US8604046 Publication Date 12/10/2013 
Target
Name:
Histamine H3 receptor
Synonyms:
Type:
Enzyme
Mol. Mass.:
43426.88
Organism:
Macaca mulatta (Rhesus macaque)
Description:
G7N499
Residue:
390
  
Inhibitor
Name:
BDBM108318
Synonyms:
US8604046, 98
Type:
Small organic molecule
Emp. Form.:
C30H45FN4O2
Mol. Mass.:
512.7023
SMILES:
C[C@H]1CCCCN1[C@H]1CCN(C1)c1ccc(N2CCC3(CCN(CC4CCOCC4)CC3)C2=O)c(F)c1
: